{"text_format":"1","workbook":"xlsx","n_sheets":24,"sheets":["Eingabe","Codes","Abflussbeiwerte","B21","B22","B4","B5a","B5b","B6","C1","D11","D12","D13","E11","E12","E13","E14","E15","F11","F12","F21","F22","F31","F32"],"not_rendered":{"charts":6,"images":22,"macros":1,"external_links":0,"defined_names":41,"comments":13,"pivot_tables":0},"unopened":[],"bounds":{"document_bytes":16777216,"sheet_cells":100000,"rows_first":2000,"rows_last":500,"rows_between":2000,"halvings":0,"cell_chars":16384,"cell_head_chars":4096},"cells_cut":0,"cells_raw":0,"read":"whole","date_system":"1900"}

{"sheet":"Eingabe","index":0,"n_rows":98,"n_cols":16,"rows_kept":98,"cut":false,"hidden":false,"merged":[[8,1,8,4],[9,1,9,4],[10,1,10,4],[65,1,65,4],[66,1,66,4],[15,1,15,3],[19,1,19,2],[20,1,20,2],[21,1,21,2],[52,1,52,2],[34,1,34,2],[29,1,29,2],[16,1,16,3],[17,1,17,3],[18,1,18,3],[24,1,24,3],[32,1,32,2],[97,1,97,4],[68,1,68,4],[75,1,75,4],[94,1,94,4],[95,1,95,3],[96,1,96,2],[73,1,73,3],[67,1,67,4],[60,1,60,4],[61,1,61,4],[62,1,62,4],[63,1,63,4],[64,1,64,4]]}
["Eingabe",null,null,null,null,null,null,null,null,null,null,null,null,null,"Einblenden","Formel"]
["Liegenschaftsentwässerung",null,null,null,null,null,null,null,null,null,null,null,null,null,"Ausblenden","SPST"]
[]
["Fachplaner",null,null,null,null,null,null,null,null,null,null,null,null,null,1]
[null,null,null,null,null,null,null,null,null,null,null,null,null,null,1]
["Auftragsnummer:",null,null,null,null,null,null,null,null,null,null,null,null,null,0]
{"$rows_left_out":93}
{"sheet":"Codes","index":1,"n_rows":216,"n_cols":9,"rows_kept":216,"cut":false,"hidden":true,"merged":[]}
[null,"Abflussbeiwert",null,null,null,"Art"]
[]
[null,"Schräg- u. Flachdächer befestigt",null,null,0.9,"DW"]
[null,"Flachdach bekiest",null,null,0.8,"DW"]
[null,"Flachdach humusiert (d > 50 cm)",null,null,0.1,"DW"]
[null,"Flachdach humusiert (d = 25-50 cm)",null,null,0.2,"DW"]
{"$rows_left_out":211}
{"sheet":"Abflussbeiwerte","index":2,"n_rows":217,"n_cols":8,"rows_kept":217,"cut":false,"hidden":true,"merged":[]}
["MinID",{"$f":"MIN(A4:A179)","v":15},null,null,null,null,"Datum:","2006-01-01"]
["MaxID",{"$f":"MAX(A4:A179)","v":175}]
["ID","Gemeinde","Zone","Code","Kürzel","ohne Versickerungsmöglichkeit","mit Versickerungsmöglichkeit"]
[{"$f":"IF(B4=Eingabe!$B$16,ROW()-3,\"\")","v":""},"Balzers","Kernzone ",{"$f":"B4&\" - \"&C4","v":"Balzers - Kernzone "},"K",null,0.4,0.25]
[{"$f":"IF(B5=Eingabe!$B$16,ROW()-3,\"\")","v":""},"Balzers","Dorfkernzone",{"$f":"B5&\" - \"&C5","v":"Balzers - Dorfkernzone"},"DK",null,0.4,0.25]
[{"$f":"IF(B6=Eingabe!$B$16,ROW()-3,\"\")","v":""},"Balzers","Dorfzone","Balzers - Dorfzone","D",null,0.4,0.25]
{"$rows_left_out":212}
{"sheet":"B21","index":3,"n_rows":51,"n_cols":19,"rows_kept":51,"cut":false,"hidden":false,"merged":[[28,0,28,1],[28,3,28,12],[3,0,3,1],[3,2,3,3],[4,0,4,1],[4,2,4,13],[5,0,5,1],[5,2,5,13],[6,0,6,1],[6,2,6,13],[7,2,7,13],[9,3,9,5],[10,3,10,5],[23,6,23,12],[37,0,37,1],[37,3,37,12],[29,0,29,1],[29,3,29,12],[30,0,30,1],[30,3,30,12],[31,0,31,1],[31,3,31,12],[34,0,34,1],[34,3,34,12],[35,3,35,12],[36,0,36,1],[36,3,36,12],[48,3,48,12],[49,3,49,12],[42,0,42,1],[42,3,42,12],[43,0,43,1],[43,3,43,12],[44,0,45,1],[44,3,45,12],[47,0,47,1],[47,3,47,12],[13,16,14,18],[21,16,21,17],[44,13,45,13],[46,3,46,12],[39,0,39,1],[39,3,39,12],[40,0,40,1],[40,3,40,12],[41,0,41,1],[41,3,41,12],[38,0,38,1],[38,3,38,12],[32,0,32,1],[32,3,32,12],[33,0,33,1],[33,3,33,12]]}
["B2","Nachweis Abflussbeiwert"]
[null,"Liegenschaftsentwässerung"]
[]
["Gemeinde",null,{"$f":"Eingabe!B16","v":0},null,null,"Parzellen-Nr.:",{"$f":"Eingabe!B23","v":0}]
["Objekt",null,{"$f":"Eingabe!B17","v":0}]
["Bauherr",null,{"$f":"Eingabe!B18","v":0}]
{"$rows_left_out":46}
{"sheet":"B22","index":4,"n_rows":41,"n_cols":22,"rows_kept":41,"cut":false,"hidden":false,"merged":[[37,0,39,9],[12,3,13,3],[12,4,13,4],[28,4,29,4],[28,5,29,5],[28,6,29,6],[28,7,30,7],[28,8,29,8],[28,9,29,9],[35,2,35,9],[20,3,21,3],[20,4,21,4],[20,5,21,5],[20,6,21,6],[28,3,29,3],[12,8,14,8],[4,7,6,7],[12,6,13,6],[4,3,5,3],[4,4,5,4],[4,5,5,5],[4,6,5,6],[12,5,13,5],[12,7,14,7],[20,11,21,11],[28,11,29,11],[20,7,22,7],[20,8,21,8],[20,9,21,9],[20,10,21,10],[28,10,29,10]]}
["B2","Nachweis Abflussbeiwert",null,null,null,null,null,null,null,null,null,null,null,null,null,{"$f":"P35","v":35},null,null,"A","B","C","D"]
[null,"Liegenschaftsentwässerung",null,null,null,null,null,null,null,null,null,null,null,null,null,{"$f":"MAX(O3:O28)","v":0},null,null,{"$f":"ROW(D11)","v":11},{"$f":"ROW(D19)","v":19},{"$f":"ROW(D27)","v":27},{"$f":"ROW(D35)","v":35}]
[null,null,null,null,null,null,null,null,null,null,null,null,null,null,null,null,null,null,{"$f":"ROW(A7)","v":7},{"$f":"ROW(A15)","v":15},{"$f":"ROW(A23)","v":23},{"$f":"ROW(A31)","v":31}]
[]
["A","Oberflächenversickerung (nicht Abflusswirksam)",null,"Fläche","Abfluss-beiwert","Fred","Abfluss",null,null,null,"Neue Zeilen in die entsprechnd vorbereiteten Tabellen einfügen bzw. löschen"]
[]
{"$rows_left_out":36}
{"sheet":"B4","index":5,"n_rows":51,"n_cols":15,"rows_kept":51,"cut":false,"hidden":false,"merged":[[50,1,51,9],[27,1,27,6],[42,1,42,6],[37,1,37,6],[38,1,38,6],[39,1,39,6],[29,1,29,6],[30,1,30,6],[31,1,31,6],[32,1,32,6],[33,1,33,6],[34,1,34,6],[35,1,35,6],[28,1,28,6],[36,1,36,6],[40,1,40,6],[41,1,41,6],[24,1,24,6],[25,1,25,6],[26,1,26,6],[4,2,4,9],[5,2,5,9],[6,2,6,9],[7,2,7,9],[19,1,19,6],[20,1,20,6],[21,1,21,6],[22,1,22,6],[23,1,23,6],[47,1,47,2],[43,1,43,6],[44,1,44,6],[45,1,45,6],[46,1,46,6]]}
["B4","Berechnung massgebender Abwasseranfall",null,null,null,null,null,null,null,null,null,null,null,null,"B4 Abwasseranfall"]
[null,"Liegenschaftsentwässerung"]
[]
["Gemeinde",null,{"$f":"IF('B21'!$C$4:$D$4=\"\",\"\",'B21'!$C$4:$D$4)","v":0},"Parzellen-Nr.:",{"$f":"IF('B21'!$G$4=\"\",\"\",'B21'!$G$4)","v":0}]
["Objekt",null,{"$f":"IF('B21'!$C$5:$J$5=\"\",\"\",'B21'!$C$5:$J$5)","v":0}]
["Bauherr",null,{"$f":"IF('B21'!$C$6:$J$6=\"\",\"\",'B21'!$C$6:$J$6)","v":0}]
{"$rows_left_out":46}
{"sheet":"B5a","index":6,"n_rows":78,"n_cols":26,"rows_kept":78,"cut":false,"hidden":false,"merged":[]}
["B5","Ermittlung Retentionsvolumen",null,null,null,null,null,null,null,null,null,null,null,"mit Wirbeldrossel, etc.",null,null,"C  Ableitung in Gewässer / Regenwasserleitung",null,null,null,null,1,2,3,4,5]
[null,"Liegenschaftsentwässerung",null,null,null,null,null,null,null,null,null,null,null,"mit Lochdrossel",null,null,"D  Ableitung in Schmutz- bzw. Mischwasserkanalisation",null,null,null,null,{"$f":"ROW(A13)","v":13},{"$f":"ROW(A27)","v":27},{"$f":"ROW(A41)","v":41},{"$f":"ROW(A55)","v":55},{"$f":"ROW(A69)","v":69}]
[null,null,null,null,null,null,null,null,null,null,null,null,null,null,null,null,null,null,null,null,null,{"$f":"ROW(D18)","v":18},{"$f":"ROW(D32)","v":32},{"$f":"ROW(D46)","v":46},{"$f":"ROW(D60)","v":60},{"$f":"ROW(D74)","v":74}]
[null,null,null,null,null,null,null,null,null,"R1",{"$f":"G10","v":0},null,null,null,{"$f":"Eingabe!B23","v":0}]
[null,null,null,null,null,null,null,null,null,"R2",{"$f":"G24","v":0}]
[null,null,null,null,null,null,null,null,null,"R3",{"$f":"G38","v":0}]
{"$rows_left_out":73}
{"sheet":"B5b","index":7,"n_rows":57,"n_cols":33,"rows_kept":57,"cut":false,"hidden":false,"merged":[[3,0,3,1],[3,2,3,3],[4,0,4,1],[4,2,4,12],[5,0,5,1],[5,2,5,12],[6,0,6,1],[6,2,6,12],[7,2,7,12],[11,12,13,12],[12,1,12,3],[12,4,12,6],[13,1,13,3],[13,4,13,6],[14,1,14,3],[14,4,14,6],[15,1,15,3],[15,4,15,6],[16,1,16,3],[16,4,16,6],[24,4,24,5],[26,0,26,12],[56,2,58,12],[17,1,17,3],[17,4,17,6],[18,1,18,3],[18,4,18,6],[19,1,19,3],[19,4,19,6],[20,1,20,3],[20,4,20,6],[23,4,23,5]]}
["B5","Ermittlung Retentionsvolumen"]
[null,"Liegenschaftsentwässerung"]
[]
["Gemeinde",null,{"$f":"Eingabe!B16","v":0},null,null,"Parzellen-Nr.:",{"$f":"Eingabe!B23","v":0}]
["Objekt",null,{"$f":"Eingabe!B17","v":0}]
["Bauherr",null,{"$f":"Eingabe!B18","v":0}]
{"$rows_left_out":52}
{"sheet":"B6","index":8,"n_rows":53,"n_cols":13,"rows_kept":53,"cut":false,"hidden":false,"merged":[[5,0,5,1],[5,2,5,12],[3,0,3,1],[3,2,3,4],[3,5,3,6],[4,0,4,1],[4,2,4,12],[27,9,27,10],[18,0,18,12],[27,6,27,8],[17,0,17,12],[9,0,9,8],[11,0,11,12],[14,0,14,12],[6,0,6,1],[6,2,6,12],[7,2,7,12],[20,0,20,8],[25,2,25,5],[15,0,15,12],[16,0,16,12],[30,9,30,10],[31,9,31,10],[30,6,30,8],[31,6,31,8],[28,9,28,10],[29,9,29,10],[28,6,28,8],[29,6,29,8],[44,7,44,8],[44,9,44,10],[45,7,45,8],[45,9,45,10],[46,5,46,6],[32,9,32,10],[33,9,33,10],[36,9,36,10],[38,0,38,8],[32,6,32,8],[33,6,33,8],[36,6,36,8],[40,2,40,3],[41,2,41,3],[41,0,41,1],[41,5,41,6],[42,5,42,6],[40,0,40,1],[40,5,40,8],[43,5,43,6],[44,5,44,6],[45,5,45,6],[46,7,46,8],[34,9,34,10],[35,9,35,10],[34,6,34,8],[35,6,35,8],[40,9,40,11],[46,9,46,10],[41,7,41,8],[41,9,41,10],[42,7,42,8],[42,9,42,10],[43,7,43,8],[43,9,43,10]]}
["B6","Sickerversuch"]
[null,"Liegenschaftsentwässerung"]
[]
["Gemeinde",null,{"$f":"IF('B21'!$C$4:$D$4=\"\",\"\",'B21'!$C$4:$D$4)","v":0},null,null,"Parzellen-Nr.:",null,{"$f":"IF('B21'!$G$4=\"\",\"\",'B21'!$G$4)","v":0}]
["Objekt",null,{"$f":"IF('B21'!$C$5:$J$5=\"\",\"\",'B21'!$C$5:$J$5)","v":0}]
["Bauherr",null,{"$f":"IF('B21'!$C$6:$J$6=\"\",\"\",'B21'!$C$6:$J$6)","v":0}]
{"$rows_left_out":48}
{"sheet":"C1","index":9,"n_rows":101,"n_cols":13,"rows_kept":101,"cut":false,"hidden":false,"merged":[[15,3,15,5],[6,0,6,1],[6,2,6,6],[3,0,3,1],[4,0,4,1],[4,2,4,6],[5,0,5,1],[5,2,5,6],[7,0,7,1],[7,2,7,6],[9,0,9,2],[10,0,10,2],[13,0,13,2],[53,3,53,5],[30,0,30,2],[32,0,32,2],[32,3,32,5],[33,0,33,2],[38,0,38,2],[24,0,24,2],[16,0,16,2],[21,0,21,2],[22,0,22,2],[15,0,15,2],[54,0,54,2],[68,0,68,2],[39,0,39,2],[41,0,41,2],[51,0,51,2],[53,0,53,2],[59,0,59,2],[70,3,70,5],[71,0,71,2],[85,0,85,2],[87,0,87,2],[87,3,87,5],[76,0,76,2],[93,0,93,2],[62,0,62,2],[79,0,79,2],[96,0,96,2],[88,0,88,2],[70,0,70,2]]}
["C1","Dimensionierung Schlammsammler"]
[null,"Liegenschaftsentwässerung"]
[]
["Gemeinde",null,{"$f":"Eingabe!B16","v":0},null,"Parzellen-Nr.",{"$f":"Eingabe!B23","v":0}]
["Objekt",null,{"$f":"Eingabe!B17","v":0}]
["Bauherr",null,{"$f":"Eingabe!B18","v":0}]
{"$rows_left_out":96}
{"sheet":"D11","index":10,"n_rows":138,"n_cols":37,"rows_kept":138,"cut":false,"hidden":false,"merged":[[6,35,7,35],[6,36,7,36],[130,0,130,2],[42,0,42,2],[43,0,43,2],[63,0,63,3],[72,0,72,2],[103,0,103,2],[101,0,101,2],[90,0,90,2],[91,0,91,2],[96,0,96,2],[100,0,100,2],[66,0,66,2],[74,0,74,2],[6,32,7,32],[34,0,34,2],[20,0,20,2],[6,31,7,31],[6,25,7,25],[6,26,7,26],[6,27,7,27],[6,28,7,28],[6,29,7,29],[6,30,7,30],[6,2,6,11],[7,2,7,11],[11,4,11,8],[10,0,10,2],[11,0,11,2],[133,0,133,2],[111,0,111,2],[115,0,115,2],[116,0,116,2],[118,0,118,2],[126,0,126,2],[131,0,131,2],[119,0,119,6],[3,0,3,1],[4,0,4,1],[5,0,5,1],[6,0,6,1],[7,0,7,1],[4,2,4,11],[5,2,5,11],[9,0,9,2],[45,0,45,2],[47,0,47,2],[12,0,12,2],[13,0,13,2],[14,0,14,2],[37,0,37,2],[38,0,38,2],[31,0,31,2],[36,0,36,2],[35,0,35,2],[41,0,41,2],[33,0,33,2],[39,0,39,2],[6,33,7,33],[6,34,7,34],[65,0,65,2],[104,0,104,6],[55,0,55,2],[58,0,58,2],[60,0,60,2],[61,0,61,2],[71,0,71,2],[48,0,48,2],[49,0,49,2],[52,0,52,2],[53,0,53,2],[54,0,54,2],[6,24,7,24],[18,0,18,2]]}
[{"$f":"\"D\"&Z1&\".1\"","v":"D1.1"},{"$f":"\"Dimensionierung Versickerungsanlage \"&Z1","v":"Dimensionierung Versickerungsanlage 1"},null,null,null,null,null,null,null,null,null,null,null,null,null,null,null,{"$f":"MAX(R108:R138,108)","v":108},null,null,null,null,null,null,"Anlage",1]
[null,"Liegenschaftsentwässerung"]
[]
["Gemeinde",null,{"$f":"Eingabe!B16","v":0},null,"Parzellen-Nr.",{"$f":"Eingabe!B23","v":0}]
["Objekt",null,{"$f":"Eingabe!B17","v":0}]
["Bauherr",null,{"$f":"Eingabe!B18","v":0},null,null,null,null,null,null,null,null,null,null,null,null,null,null,null,null,null,null,null,null,null,null,null,null,null,null,null,null,"Typ2/3b","Typ 3a","Typ 3c","Typ 3d"]
{"$rows_left_out":133}
{"sheet":"D12","index":11,"n_rows":138,"n_cols":37,"rows_kept":138,"cut":false,"hidden":false,"merged":[[6,26,7,26],[6,27,7,27],[6,28,7,28],[6,29,7,29],[3,0,3,1],[4,0,4,1],[4,2,4,11],[5,0,5,1],[5,2,5,11],[6,0,6,1],[6,2,6,11],[31,0,31,2],[6,36,7,36],[7,0,7,1],[7,2,7,11],[9,0,9,2],[10,0,10,2],[11,0,11,2],[11,4,11,8],[6,30,7,30],[6,31,7,31],[6,32,7,32],[6,33,7,33],[6,34,7,34],[6,35,7,35],[6,24,7,24],[6,25,7,25],[12,0,12,2],[13,0,13,2],[14,0,14,2],[18,0,18,2],[20,0,20,2],[47,0,47,2],[33,0,33,2],[34,0,34,2],[35,0,35,2],[36,0,36,2],[37,0,37,2],[38,0,38,2],[39,0,39,2],[41,0,41,2],[42,0,42,2],[43,0,43,2],[45,0,45,2],[66,0,66,2],[48,0,48,2],[49,0,49,2],[52,0,52,2],[53,0,53,2],[54,0,54,2],[55,0,55,2],[58,0,58,2],[60,0,60,2],[61,0,61,2],[63,0,63,3],[65,0,65,2],[115,0,115,2],[71,0,71,2],[72,0,72,2],[74,0,74,2],[90,0,90,2],[91,0,91,2],[96,0,96,2],[100,0,100,2],[101,0,101,2],[103,0,103,2],[104,0,104,6],[111,0,111,2],[133,0,133,2],[116,0,116,2],[118,0,118,2],[119,0,119,6],[126,0,126,2],[130,0,130,2],[131,0,131,2]]}
[{"$f":"\"D\"&Z1&\".1\"","v":"D2.1"},{"$f":"\"Dimensionierung Versickerungsanlage \"&Z1","v":"Dimensionierung Versickerungsanlage 2"},null,null,null,null,null,null,null,null,null,null,null,null,null,null,null,{"$f":"MAX(R108:R138,108)","v":108},null,null,null,null,null,null,"Anlage",2]
[null,"Liegenschaftsentwässerung"]
[]
["Gemeinde",null,{"$f":"Eingabe!B16","v":0},null,"Parzellen-Nr.",{"$f":"Eingabe!B23","v":0}]
["Objekt",null,{"$f":"Eingabe!B17","v":0}]
["Bauherr",null,{"$f":"Eingabe!B18","v":0},null,null,null,null,null,null,null,null,null,null,null,null,null,null,null,null,null,null,null,null,null,null,null,null,null,null,null,null,"Typ2/3b","Typ 3a","Typ 3c","Typ 3d"]
{"$rows_left_out":133}
{"sheet":"D13","index":12,"n_rows":138,"n_cols":37,"rows_kept":138,"cut":false,"hidden":false,"merged":[[6,26,7,26],[6,27,7,27],[6,28,7,28],[6,29,7,29],[3,0,3,1],[4,0,4,1],[4,2,4,11],[5,0,5,1],[5,2,5,11],[6,0,6,1],[6,2,6,11],[31,0,31,2],[6,36,7,36],[7,0,7,1],[7,2,7,11],[9,0,9,2],[10,0,10,2],[11,0,11,2],[11,4,11,8],[6,30,7,30],[6,31,7,31],[6,32,7,32],[6,33,7,33],[6,34,7,34],[6,35,7,35],[6,24,7,24],[6,25,7,25],[12,0,12,2],[13,0,13,2],[14,0,14,2],[18,0,18,2],[20,0,20,2],[47,0,47,2],[33,0,33,2],[34,0,34,2],[35,0,35,2],[36,0,36,2],[37,0,37,2],[38,0,38,2],[39,0,39,2],[41,0,41,2],[42,0,42,2],[43,0,43,2],[45,0,45,2],[66,0,66,2],[48,0,48,2],[49,0,49,2],[52,0,52,2],[53,0,53,2],[54,0,54,2],[55,0,55,2],[58,0,58,2],[60,0,60,2],[61,0,61,2],[63,0,63,3],[65,0,65,2],[115,0,115,2],[71,0,71,2],[72,0,72,2],[74,0,74,2],[90,0,90,2],[91,0,91,2],[96,0,96,2],[100,0,100,2],[101,0,101,2],[103,0,103,2],[104,0,104,6],[111,0,111,2],[133,0,133,2],[116,0,116,2],[118,0,118,2],[119,0,119,6],[126,0,126,2],[130,0,130,2],[131,0,131,2]]}
[{"$f":"\"D\"&Z1&\".1\"","v":"D3.1"},{"$f":"\"Dimensionierung Versickerungsanlage \"&Z1","v":"Dimensionierung Versickerungsanlage 3"},null,null,null,null,null,null,null,null,null,null,null,null,null,null,null,{"$f":"MAX(R108:R138,108)","v":108},null,null,null,null,null,null,"Anlage",3]
[null,"Liegenschaftsentwässerung"]
[]
["Gemeinde",null,{"$f":"Eingabe!B16","v":0},null,"Parzellen-Nr.",{"$f":"Eingabe!B23","v":0}]
["Objekt",null,{"$f":"Eingabe!B17","v":0}]
["Bauherr",null,{"$f":"Eingabe!B18","v":0},null,null,null,null,null,null,null,null,null,null,null,null,null,null,null,null,null,null,null,null,null,null,null,null,null,null,null,null,"Typ2/3b","Typ 3a","Typ 3c","Typ 3d"]
{"$rows_left_out":133}
{"sheet":"E11","index":13,"n_rows":62,"n_cols":26,"rows_kept":62,"cut":false,"hidden":false,"merged":[[46,3,46,4],[8,15,8,25],[9,24,10,24],[9,25,10,25],[9,15,10,15],[9,16,10,16],[9,17,10,17],[9,18,10,18],[9,19,10,19],[9,20,10,20],[9,21,10,21],[9,22,10,22],[9,23,10,23],[9,0,9,8],[22,0,22,8],[4,2,4,8],[5,2,5,8],[6,2,6,8],[7,2,7,8],[3,0,3,1],[4,0,4,1],[5,0,5,1],[6,0,6,1],[7,0,7,1]]}
[{"$f":"\"E\"&R1&\".1\"","v":"E1.1"},{"$f":"\"Dimensionierung Retentionsanlage \"&R1","v":"Dimensionierung Retentionsanlage 1"},null,null,null,null,null,null,null,null,null,null,null,null,null,null,"Anlage",1]
[null,"Liegenschaftsentwässerung"]
[]
["Gemeinde",null,{"$f":"IF('B21'!$C$4:$D$4=\"\",\"\",'B21'!$C$4:$D$4)","v":0},null,"Parzellen-Nr.",{"$f":"IF('B21'!$G$4=\"\",\"\",'B21'!$G$4)","v":0}]
["Objekt",null,{"$f":"IF('B21'!$C$5:$J$5=\"\",\"\",'B21'!$C$5:$J$5)","v":0}]
["Bauherr",null,{"$f":"IF('B21'!$C$6:$J$6=\"\",\"\",'B21'!$C$6:$J$6)","v":0}]
{"$rows_left_out":57}
{"sheet":"E12","index":14,"n_rows":62,"n_cols":26,"rows_kept":62,"cut":false,"hidden":false,"merged":[[46,3,46,4],[9,21,10,21],[9,22,10,22],[9,23,10,23],[9,24,10,24],[9,25,10,25],[22,0,22,8],[7,0,7,1],[7,2,7,8],[8,15,8,25],[9,0,9,8],[9,15,10,15],[9,16,10,16],[9,17,10,17],[9,18,10,18],[9,19,10,19],[9,20,10,20],[6,0,6,1],[6,2,6,8],[3,0,3,1],[4,0,4,1],[4,2,4,8],[5,0,5,1],[5,2,5,8]]}
[{"$f":"\"E\"&R1&\".1\"","v":"E2.1"},{"$f":"\"Dimensionierung Retentionsanlage \"&R1","v":"Dimensionierung Retentionsanlage 2"},null,null,null,null,null,null,null,null,null,null,null,null,null,null,"Anlage",2]
[null,"Liegenschaftsentwässerung"]
[]
["Gemeinde",null,{"$f":"IF('B21'!$C$4:$D$4=\"\",\"\",'B21'!$C$4:$D$4)","v":0},null,"Parzellen-Nr.",{"$f":"IF('B21'!$G$4=\"\",\"\",'B21'!$G$4)","v":0}]
["Objekt",null,{"$f":"IF('B21'!$C$5:$J$5=\"\",\"\",'B21'!$C$5:$J$5)","v":0}]
["Bauherr",null,{"$f":"IF('B21'!$C$6:$J$6=\"\",\"\",'B21'!$C$6:$J$6)","v":0}]
{"$rows_left_out":57}
{"sheet":"E13","index":15,"n_rows":62,"n_cols":26,"rows_kept":62,"cut":false,"hidden":false,"merged":[[46,3,46,4],[9,21,10,21],[9,22,10,22],[9,23,10,23],[9,24,10,24],[9,25,10,25],[22,0,22,8],[7,0,7,1],[7,2,7,8],[8,15,8,25],[9,0,9,8],[9,15,10,15],[9,16,10,16],[9,17,10,17],[9,18,10,18],[9,19,10,19],[9,20,10,20],[6,0,6,1],[6,2,6,8],[3,0,3,1],[4,0,4,1],[4,2,4,8],[5,0,5,1],[5,2,5,8]]}
[{"$f":"\"E\"&R1&\".1\"","v":"E3.1"},{"$f":"\"Dimensionierung Retentionsanlage \"&R1","v":"Dimensionierung Retentionsanlage 3"},null,null,null,null,null,null,null,null,null,null,null,null,null,null,"Anlage",3]
[null,"Liegenschaftsentwässerung"]
[]
["Gemeinde",null,{"$f":"IF('B21'!$C$4:$D$4=\"\",\"\",'B21'!$C$4:$D$4)","v":0},null,"Parzellen-Nr.",{"$f":"IF('B21'!$G$4=\"\",\"\",'B21'!$G$4)","v":0}]
["Objekt",null,{"$f":"IF('B21'!$C$5:$J$5=\"\",\"\",'B21'!$C$5:$J$5)","v":0}]
["Bauherr",null,{"$f":"IF('B21'!$C$6:$J$6=\"\",\"\",'B21'!$C$6:$J$6)","v":0}]
{"$rows_left_out":57}
{"sheet":"E14","index":16,"n_rows":62,"n_cols":26,"rows_kept":62,"cut":false,"hidden":false,"merged":[[6,0,6,1],[6,2,6,8],[3,0,3,1],[4,0,4,1],[4,2,4,8],[5,0,5,1],[5,2,5,8],[9,25,10,25],[22,0,22,8],[7,0,7,1],[7,2,7,8],[8,15,8,25],[9,0,9,8],[9,15,10,15],[9,16,10,16],[9,17,10,17],[9,18,10,18],[9,19,10,19],[9,20,10,20],[46,3,46,4],[9,21,10,21],[9,22,10,22],[9,23,10,23],[9,24,10,24]]}
[{"$f":"\"E\"&R1&\".1\"","v":"E4.1"},{"$f":"\"Dimensionierung Retentionsanlage \"&R1","v":"Dimensionierung Retentionsanlage 4"},null,null,null,null,null,null,null,null,null,null,null,null,null,null,"Anlage",4]
[null,"Liegenschaftsentwässerung"]
[]
["Gemeinde",null,{"$f":"IF('B21'!$C$4:$D$4=\"\",\"\",'B21'!$C$4:$D$4)","v":0},null,"Parzellen-Nr.",{"$f":"IF('B21'!$G$4=\"\",\"\",'B21'!$G$4)","v":0}]
["Objekt",null,{"$f":"IF('B21'!$C$5:$J$5=\"\",\"\",'B21'!$C$5:$J$5)","v":0}]
["Bauherr",null,{"$f":"IF('B21'!$C$6:$J$6=\"\",\"\",'B21'!$C$6:$J$6)","v":0}]
{"$rows_left_out":57}
{"sheet":"E15","index":17,"n_rows":62,"n_cols":26,"rows_kept":62,"cut":false,"hidden":false,"merged":[[6,0,6,1],[6,2,6,8],[3,0,3,1],[4,0,4,1],[4,2,4,8],[5,0,5,1],[5,2,5,8],[9,25,10,25],[22,0,22,8],[7,0,7,1],[7,2,7,8],[8,15,8,25],[9,0,9,8],[9,15,10,15],[9,16,10,16],[9,17,10,17],[9,18,10,18],[9,19,10,19],[9,20,10,20],[46,3,46,4],[9,21,10,21],[9,22,10,22],[9,23,10,23],[9,24,10,24]]}
[{"$f":"\"E\"&R1&\".1\"","v":"E5.1"},{"$f":"\"Dimensionierung Retentionsanlage \"&R1","v":"Dimensionierung Retentionsanlage 5"},null,null,null,null,null,null,null,null,null,null,null,null,null,null,"Anlage",5]
[null,"Liegenschaftsentwässerung"]
[]
["Gemeinde",null,{"$f":"IF('B21'!$C$4:$D$4=\"\",\"\",'B21'!$C$4:$D$4)","v":0},null,"Parzellen-Nr.",{"$f":"IF('B21'!$G$4=\"\",\"\",'B21'!$G$4)","v":0}]
["Objekt",null,{"$f":"IF('B21'!$C$5:$J$5=\"\",\"\",'B21'!$C$5:$J$5)","v":0}]
["Bauherr",null,{"$f":"IF('B21'!$C$6:$J$6=\"\",\"\",'B21'!$C$6:$J$6)","v":0}]
{"$rows_left_out":57}
{"sheet":"F11","index":18,"n_rows":58,"n_cols":23,"rows_kept":58,"cut":false,"hidden":false,"merged":[[41,0,41,3],[35,0,35,3],[36,0,36,3],[37,0,37,3],[38,0,38,3],[39,0,39,3],[40,0,40,3],[34,0,34,3],[23,0,23,3],[24,0,24,3],[25,0,25,3],[26,0,26,3],[27,0,27,3],[28,0,28,3],[29,0,29,3],[30,0,30,3],[31,0,31,3],[32,0,32,3],[33,0,33,3],[22,0,22,3],[13,0,13,3],[14,0,14,3],[15,0,15,3],[16,0,16,3],[17,0,17,3],[18,0,18,3],[19,0,19,3],[20,0,20,3],[21,0,21,3]]}
[{"$f":"\"F\"&O1&\".1\"","v":"F1.1"},{"$f":"\"Dimensionierung Abwasserhebeanlage \"&O1","v":"Dimensionierung Abwasserhebeanlage 1"},null,null,null,null,null,null,null,null,null,null,null,"Anlage",1,{"$f":"ROW(A47)","v":47}]
[null,"Liegenschaftsentwässerung",null,null,null,null,null,null,null,null,null,null,null,null,null,{"$f":"ROW(D52)","v":52}]
[]
[]
[]
[]
{"$rows_left_out":53}
{"sheet":"F12","index":19,"n_rows":56,"n_cols":21,"rows_kept":56,"cut":false,"hidden":false,"merged":[]}
[{"$f":"\"F\"&U1&\".1\"","v":"F1.1"},{"$f":"\"Dimensionierung Abwasserhebeanlage \"&U1","v":"Dimensionierung Abwasserhebeanlage 1"},null,null,null,null,null,null,null,null,null,null,null,null,null,null,null,null,null,"Anlage",1]
[null,"Liegenschaftsentwässerung"]
[]
["Dimensionierung Pumpenschacht"]
[]
["Schachtwahl (Grundriss Schacht)",null,null,null,{"$f":"INDEX(Codes!B210:B212,O6,1)","v":"rund"},null,null,null,null,null,null,null,null,null,1]
{"$rows_left_out":51}
{"sheet":"F21","index":20,"n_rows":58,"n_cols":23,"rows_kept":58,"cut":false,"hidden":false,"merged":[[24,0,24,3],[13,0,13,3],[14,0,14,3],[15,0,15,3],[16,0,16,3],[17,0,17,3],[18,0,18,3],[19,0,19,3],[20,0,20,3],[21,0,21,3],[22,0,22,3],[23,0,23,3],[36,0,36,3],[25,0,25,3],[26,0,26,3],[27,0,27,3],[28,0,28,3],[29,0,29,3],[30,0,30,3],[31,0,31,3],[32,0,32,3],[33,0,33,3],[34,0,34,3],[35,0,35,3],[37,0,37,3],[38,0,38,3],[39,0,39,3],[40,0,40,3],[41,0,41,3]]}
[{"$f":"\"F\"&O1&\".1\"","v":"F2.1"},{"$f":"\"Dimensionierung Abwasserhebeanlage \"&O1","v":"Dimensionierung Abwasserhebeanlage 2"},null,null,null,null,null,null,null,null,null,null,null,"Anlage",2,{"$f":"ROW(A47)","v":47}]
[null,"Liegenschaftsentwässerung",null,null,null,null,null,null,null,null,null,null,null,null,null,{"$f":"ROW(D52)","v":52}]
[]
[]
[]
[]
{"$rows_left_out":53}
{"sheet":"F22","index":21,"n_rows":56,"n_cols":21,"rows_kept":56,"cut":false,"hidden":false,"merged":[]}
[{"$f":"\"F\"&U1&\".1\"","v":"F2.1"},{"$f":"\"Dimensionierung Abwasserhebeanlage \"&U1","v":"Dimensionierung Abwasserhebeanlage 2"},null,null,null,null,null,null,null,null,null,null,null,null,null,null,null,null,null,"Anlage",2]
[null,"Liegenschaftsentwässerung"]
[]
["Dimensionierung Pumpenschacht"]
[]
["Schachtwahl (Grundriss Schacht)",null,null,null,{"$f":"INDEX(Codes!B210:B212,O6,1)","v":"rund"},null,null,null,null,null,null,null,null,null,1]
{"$rows_left_out":51}
{"sheet":"F31","index":22,"n_rows":58,"n_cols":23,"rows_kept":58,"cut":false,"hidden":false,"merged":[[24,0,24,3],[13,0,13,3],[14,0,14,3],[15,0,15,3],[16,0,16,3],[17,0,17,3],[18,0,18,3],[19,0,19,3],[20,0,20,3],[21,0,21,3],[22,0,22,3],[23,0,23,3],[36,0,36,3],[25,0,25,3],[26,0,26,3],[27,0,27,3],[28,0,28,3],[29,0,29,3],[30,0,30,3],[31,0,31,3],[32,0,32,3],[33,0,33,3],[34,0,34,3],[35,0,35,3],[37,0,37,3],[38,0,38,3],[39,0,39,3],[40,0,40,3],[41,0,41,3]]}
[{"$f":"\"F\"&O1&\".1\"","v":"F3.1"},{"$f":"\"Dimensionierung Abwasserhebeanlage \"&O1","v":"Dimensionierung Abwasserhebeanlage 3"},null,null,null,null,null,null,null,null,null,null,null,"Anlage",3,{"$f":"ROW(A47)","v":47}]
[null,"Liegenschaftsentwässerung",null,null,null,null,null,null,null,null,null,null,null,null,null,{"$f":"ROW(D52)","v":52}]
[]
[]
[]
[]
{"$rows_left_out":53}
{"sheet":"F32","index":23,"n_rows":56,"n_cols":21,"rows_kept":56,"cut":false,"hidden":false,"merged":[]}
[{"$f":"\"F\"&U1&\".1\"","v":"F3.1"},{"$f":"\"Dimensionierung Abwasserhebeanlage \"&U1","v":"Dimensionierung Abwasserhebeanlage 3"},null,null,null,null,null,null,null,null,null,null,null,null,null,null,null,null,null,"Anlage",3]
[null,"Liegenschaftsentwässerung"]
[]
["Dimensionierung Pumpenschacht"]
[]
["Schachtwahl (Grundriss Schacht)",null,null,null,{"$f":"INDEX(Codes!B210:B212,O6,1)","v":"rund"},null,null,null,null,null,null,null,null,null,1]
{"$rows_left_out":50}